Update actions/checkout action to v5 #493
This run and associated checks have been archived and are scheduled for deletion.
Learn more about checks retention
Annotations
2 errors, 6 warnings, and 3 notices
|
DefaultConfigTests.apiCheck should succeed when public classes match api file ignoring case():
modules/bcv-gradle-plugin-functional-tests/src/functionalTest/kotlin/kotlinx/validation/test/DefaultConfigTests.kt#L255
org.gradle.testkit.runner.UnexpectedBuildFailure: Unexpected build execution failure in /var/folders/y6/nj790rtn62lfktb1sh__79hc0000gn/T/junit-7598292866618652539 with arguments [--configuration-cache, --info, --stacktrace, :apiCheck]
Output:
The client will now receive all logging from the daemon (pid: 12680). The daemon log file: /Users/runner/work/kotlin-binary-compatibility-validator-mu/kotlin-binary-compatibility-validator-mu/modules/bcv-gradle-plugin-functional-tests/build/tmp/functionalTest/work/.gradle-test-kit/test-kit-daemon/7.6/daemon-12680.out.log
Starting build in new daemon [memory: 512 MiB]
Closing daemon's stdin at end of input.
The daemon will no longer process any standard input.
Shared read-only dependency cache is an incubating feature.
The read-only dependency cache is enabled
The GRADLE_RO_DEP_CACHE environment variable was set to /Users/runner/.gradle/caches
Using 3 worker leases.
Configuration cache is an incubating feature.
Received JVM installation metadata from '/Users/runner/hostedtoolcache/Java_Temurin-Hotspot_jdk/11.0.28-6/arm64/Contents/Home': {JAVA_HOME=/Users/runner/hostedtoolcache/Java_Temurin-Hotspot_jdk/11.0.28-6/arm64/Contents/Home, JAVA_VERSION=11.0.28, JAVA_VENDOR=Eclipse Adoptium, RUNTIME_NAME=OpenJDK Runtime Environment, RUNTIME_VERSION=11.0.28+6, VM_NAME=OpenJDK 64-Bit Server VM, VM_VERSION=11.0.28+6, VM_VENDOR=Eclipse Adoptium, OS_ARCH=aarch64}
Calculating task graph as no configuration cache is available for tasks: :apiCheck
Watching the file system is configured to be enabled if available
Now considering [/private/var/folders/y6/nj790rtn62lfktb1sh__79hc0000gn/T/junit-7598292866618652539] as hierarchies to watch
File system watching is active
Starting Build
Generating /Users/runner/work/kotlin-binary-compatibility-validator-mu/kotlin-binary-compatibility-validator-mu/modules/bcv-gradle-plugin-functional-tests/build/tmp/functionalTest/work/.gradle-test-kit/caches/7.6/generated-gradle-jars/gradle-api-7.6.jar
Cannot use Kotlin build script compile avoidance with /Users/runner/work/kotlin-binary-compatibility-validator-mu/kotlin-binary-compatibility-validator-mu/modules/bcv-gradle-plugin-functional-tests/build/tmp/functionalTest/work/.gradle-test-kit/caches/7.6/generated-gradle-jars/gradle-api-7.6.jar: class org/gradle/configurationcache/extensions/AutoCloseableExtensionsKt: inline fun useToRun(): compile avoidance is not supported with public inline functions
Cannot use Kotlin build script compile avoidance with /Users/runner/.gradle/wrapper/dists/gradle-7.6-bin/9l9tetv7ltxvx3i8an4pb86ye/gradle-7.6/lib/kotlin-stdlib-1.7.10.jar: class kotlin/ArrayIntrinsicsKt: inline fun emptyArray(): compile avoidance is not supported with public inline functions
Cannot use Kotlin build script compile avoidance with /Users/runner/.gradle/wrapper/dists/gradle-7.6-bin/9l9tetv7ltxvx3i8an4pb86ye/gradle-7.6/lib/kotlin-reflect-1.7.10.jar: class kotlin/reflect/full/KAnnotatedElements: inline fun findAnnotation(): compile avoidance is not supported with public inline functions
Cannot use Kotlin build script compile avoidance with /Users/runner/.gradle/wrapper/dists/gradle-7.6-bin/9l9tetv7ltxvx3i8an4pb86ye/gradle-7.6/lib/kotlin-stdlib-jdk8-1.7.10.jar: class kotlin/jvm/optionals/OptionalsKt: inline fun getOrElse(): compile avoidance is not supported with public inline functions
Cannot use Kotlin build script compile avoidance with /Users/runner/work/kotlin-binary-compatibility-validator-mu/kotlin-binary-compatibility-validator-mu/modules/bcv-gradle-plugin-functional-tests/build/tmp/functionalTest/work/.gradle-test-kit/caches/7.6/generated-gradle-jars/gradle-kotlin-dsl-extensions-7.6.jar: class org/gradle/kotlin/dsl/GradleApiKotlinDslExtensions0Kt: inline fun environment(): compile avoidance is not supported with public inline functions
Cannot use Kotlin build script compile avoidance with /Users/runner/.gradle/wrapper/dists/gradle-7.6-bin/9l9tetv7ltxvx3i8an4pb86ye/gradle-7.6/lib/gradle-kotlin-dsl-7.6.jar: class org/gradle/kotlin/dsl/ArtifactHandlerScope: inline fun invoke(): compile avoidance is not supported with public inline functions
Kotlin DSL script compilation (Settings/TopLevel/stage1) is not up-to-date because:
No history is available.
Watching 1 directory hierarchies to track changes
Kotlin DSL script compilation (Settings/TopLevel/stage2) is not up-to-date because:
No history is available.
Settings evaluated using settings file '/private/var/folders/y6/nj790rtn62lfktb1sh__79hc0000gn/T/junit-7598292866618652539/settings.gradle.kts'.
Projects loaded. Root project using build file '/private/var/folders/y6/nj790rtn62lfktb1sh__79hc0000gn/T/junit-7598292866618652539/build.gradle.kts'.
Included projects: [root project 'junit-7598292866618652539']
> Configure project :
Evaluating root project 'junit-7598292866618652539' using build file '/private/var/folders/y6/nj790rtn62lfktb1sh__79hc0000gn/T/junit-7598292866618652539/build.gradle.kts'.
Caching disabled for Kotlin DSL plugin accessors for classpath '3479b55c9fe4e4b4507cd2ca96307649' because:
Build cache is disabled
Kotlin DSL plugin accessors for classpath '3479b55c9fe4e4b4507cd2ca96307649' is not up-to-date because:
No history is available.
Caching disabled for Kotlin DSL script compilation (Project/TopLevel/stage1) because:
Build cache is disabled
Kotlin DSL script compilation (Project/TopLevel/stage1) is not up-to-date because:
No history is available.
Downloading https://plugins.gradle.org/m2/org/jetbrains/kotlin/jvm/org.jetbrains.kotlin.jvm.gradle.plugin/1.7.20/org.jetbrains.kotlin.jvm.gradle.plugin-1.7.20.pom to /Users/runner/work/kotlin-binary-compatibility-validator-mu/kotlin-binary-compatibility-validator-mu/modules/bcv-gradle-plugin-functional-tests/build/tmp/functionalTest/work/.gradle-test-kit/.tmp/gradle_download7311965345791544236bin
Found locally available resource with matching checksum: [https://plugins.gradle.org/m2/org/jetbrains/kotlin/kotlin-gradle-plugin/1.7.20/kotlin-gradle-plugin-1.7.20.pom, /Users/runner/work/kotlin-binary-compatibility-validator-mu/kotlin-binary-compatibility-validator-mu/modules/bcv-gradle-plugin-functional-tests/build/tmp/functionalTest/work/.gradle-test-kit/caches/modules-2/files-2.1/org.jetbrains.kotlin/kotlin-gradle-plugin/1.7.20/55d17b4954f1d1cceee192d1adb608ad7f565121/kotlin-gradle-plugin-1.7.20.pom]
Downloading https://plugins.gradle.org/m2/org/jetbrains/kotlin/kotlin-gradle-plugin/1.7.20/kotlin-gradle-plugin-1.7.20.module to /Users/runner/work/kotlin-binary-compatibility-validator-mu/kotlin-binary-compatibility-validator-mu/modules/bcv-gradle-plugin-functional-tests/build/tmp/functionalTest/work/.gradle-test-kit/.tmp/gradle_download17438997278149697642bin
Found locally available resource with matching checksum: [https://plugins.gradle.org/m2/org/jetbrains/kotlin/kotlin-gradle-plugin-api/1.7.20/kotlin-gradle-plugin-api-1.7.20.pom, /Users/runner/work/kotlin-binary-compatibility-validator-mu/kotlin-binary-compatibility-validator-mu/modules/bcv-gradle-plugin-functional-tests/build/tmp/functionalTest/work/.gradle-test-kit/caches/modules-2/files-2.1/org.jetbrains.kotlin/kotlin-gradle-plugin-api/1.7.20/5ca03571b036efb6a7f05e9d368f512193017965/kotlin-gradle-plugin-api-1.7.20.pom]
Found locally available resource with matching checksum: [https://plugins.gradle.org/m2/org/jetbrains/kotlin/kotlin-gradle-plugin-api/1.7.20/kotlin-gradle-plugin-api-1.7.20.module, /Users/runner/work/kotlin-binary-compatibility-validator-mu/kotlin-binary-compatibility-validator-mu/modules/bcv-gradle-plugin-functional-tests/build/tmp/functionalTest/work/.gradle-test-kit/caches/modules-2/files-2.1/org.jetbrains.kotlin/kotlin-gradle-plugin-api/1.7.20/f8a6438d0a269337bb19b9b1556983cacb30a92d/kotlin-gradle-plugin-api-1.7.20.module]
Found locally available resource with matching checksum: [https://plugins.gradle.org/m2/org/jetbrains/kotlin/kotlin-gradle-plugin-model/1.7.20/kotlin-gradle-plugin-model-1.7.20.pom, /Users/runner/work/kotlin-binary-compatibility-validator-mu/kotlin-binary-compatibility-validator-mu/modules/bcv-gradle-plugin-functional-tests/build/tmp/functionalTest/work/.gradle-test-kit/caches/modules-2/files-2.1/org.jetbrains.kotlin/kotlin-gradle-plugin-model/1.7.20/b7cadb43292187a0bc97381a1a4a731638bc188c/kotlin-gradle-plugin-model-1.7.20.pom]
Found locally available resource with matching checksum: [https://plugins.gradle.org/m2/org/jetbrains/kotlin/kotlin-gradle-plugin-model/1.7.20/kotlin-gradle-plugin-model-1.7.20.module, /Users/runner/work/kotlin-binary-compatibility-validator-mu/kotlin-binary-compatibility-validator-mu/modules/bcv-gradle-plugin-functional-tests/build/tmp/functionalTest/work/.gradle-test-kit/caches/modules-2/files-2.1/org.jetbrains.kotlin/kotlin-gradle-plugin-model/1.7.20/6c74f09c5b4d836a82693c0a99525be19a03f687/kotlin-gradle-plugin-model-1.7.20.module]
Found locally available resource with matching checksum: [https://plugins.gradle.org/m2/org/jetbrains/kotlin/kotlin-tooling-core/1.7.20/kotlin-tooling-core-1.7.20.pom, /Users/runner/work/kotlin-binary-compatibility-validator-mu/kotlin-binary-compatibility-validator-mu/modules/bcv-gradle-plugin-functional-tests/build/tmp/functionalTest/work/.gradle-test-kit/caches/modules-2/files-2.1/org.jetbrains.kotlin/kotlin-tooling-core/1.7.20/847e64e698ca7323153072086b669844dfddc700/kotlin-tooling-core-1.7.20.pom]
Found locally available resource with matching checksum: [https://plugins.gradle.org/m2/org/jetbrains/kotlin/kotlin-gradle-plugin-idea/1.7.20/kotlin-gradle-plugin-idea-1.7.20.pom, /Users/runner/work/kotlin-binary-compatibility-validator-mu/kotlin-binary-compatibility-validator-mu/modules/bcv-gradle-plugin-functional-tests/build/tmp/functionalTest/work/.gradle-test-kit/caches/modules-2/files-2.1/org.jetbrains.kotlin/kotlin-gradle-plugin-idea/1.7.20/9ba0677ef6f47b8965be8d50a0158db48e425d19/kotlin-gradle-plugin-idea-1.7.20.pom]
Found locally available resource with matching checksum: [https://plugins.gradle.org/m2/org/jetbrains/kotlin/kotlin-gradle-plugin-idea/1.7.20/kotlin-gradle-plugin-idea-1.7.20.module, /Users/runner/work/kotlin-binary-compatibility-validator-mu/kotlin-binary-compatibility-validator-mu/modules/bcv-gradle-plugin-functional-tests/build/tmp/functionalTest/work/.gradle-test-kit/caches/modules-2/files-2.1/org.jetbrains.kotlin/kotlin-gradle-plugin-idea/1.7.20/6b205fa5abbb70f6f68a6b1e9e7b342d1464e7d3/kotlin-gradle-plugin-idea-1.7.20.module]
Found locally available resource with matching checksum: [https://plugins.gradle.org/m2/org/jetbrains/kotlin/kotlin-gradle-plugin-idea-proto/1.7.20/kotlin-gradle-plugin-idea-proto-1.7.20.pom, /Users/runner/work/kotlin-binary-compatibility-validator-mu/kotlin-binary-compatibility-validator-mu/modules/bcv-gradle-plugin-functional-tests/build/tmp/functionalTest/work/.gradle-test-kit/caches/modules-2/files-2.1/org.jetbrains.kotlin/kotlin-gradle-plugin-idea-proto/1.7.20/d97dde047434d5bc4edb8a22beb92499cb16c7a0/kotlin-gradle-plugin-idea-proto-1.7.20.pom]
Found locally available resource with matching checksum: [https://plugins.gradle.org/m2/org/jetbrains/kotlin/kotlin-util-klib/1.7.20/kotlin-util-klib-1.7.20.pom, /Users/runner/work/kotlin-binary-compatibility-validator-mu/kotlin-binary-compatibility-validator-mu/modules/bcv-gradle-plugin-functional-tests/build/tmp/functionalTest/work/.gradle-test-kit/caches/modules-2/files-2.1/org.jetbrains.kotlin/kotlin-util-klib/1.7.20/82ab0f9bf068ac00335ca913ad253443738444d7/kotlin-util-klib-1.7.20.pom]
Found locally available resource with matching checksum: [https://plugins.gradle.org/m2/org/jetbrains/kotlin/kotlin-klib-commonizer-api/1.7.20/kotlin-klib-commonizer-api-1.7.20.pom, /Users/runner/work/kotlin-binary-compatibility-validator-mu/kotlin-binary-compatibility-validator-mu/modules/bcv-gradle-plugin-functional-tests/build/tmp/functionalTest/work/.gradle-test-kit/caches/modules-2/files-2.1/org.jetbrains.kotlin/kotlin-klib-commonizer-api/1.7.20/2a03bdd0a6b57420008738af9195f67fb6427571/kotlin-klib-commonizer-api-1.7.20.pom]
Found locally available resource with matching checksum: [https://plugins.gradle.org/m2/org/jetbrains/kotlin/kotlin-project-model/1.7.20/kotlin-project-model-1.7.20.pom, /Users/runner/work/kotlin-binary-compatibility-validator-mu/kotlin-binary-compatibility-validator-mu/modules/bcv-gradle-plugin-functional-tests/build/tmp/functionalTest/work/.gradle-test-kit/caches/modules-2/files-2.1/org.jetbrains.kotlin/kotlin-project-model/1.7.20/6cfebc40ca34f0128fdb65f35bfb15a3c8312d21/kotlin-project-model-1.7.20.pom]
Found locally available resource with matching checksum: [https://plugins.gradle.org/m2/org/jetbrains/kotlin/kotlin-compiler-embeddable/1.7.20/kotlin-compiler-embeddable-1.7.20.pom, /Users/runner/work/kotlin-binary-compatibility-validator-mu/kotlin-binary-compatibility-validator-mu/modules/bcv-gradle-plugin-functional-tests/build/tmp/functionalTest/work/.gradle-test-kit/caches/modules-2/files-2.1/org.jetbrains.kotlin/kotlin-compiler-embeddable/1.7.20/d493a2fd1c0514a84744ba6abcf0325c23353c44/kotlin-compiler-embeddable-1.7.20.pom]
Found locally available resource with matching checksum: [https://plugins.gradle.org/m2/org/jetbrains/kotlin/kotlin-annotation-processing-gradle/1.7.20/kotlin-annotation-processing-gradle-1.7.20.pom, /Users/runner/work/kotlin-binary-compatibility-validator-mu/kotlin-binary-compatibility-validator-mu/modules/bcv-gradle-plugin-functional-tests/build/tmp/functionalTest/work/.gradle-test-kit/caches/modules-2/files-2.1/org.jetbrains.kotlin/kotlin-annotation-processing-gradle/1.7.20/4e90a1c7777430f1dc9a9cb84173690d44af2ad0/kotlin-annotation-processing-gradle-1.7.20.pom]
Found locally available resource with matching checksum: [https://plugins.gradle.org/m2/org/jetbrains/kotlin/kotlin-android-extensions/1.7.20/kotlin-android-extensions-1.7.20.pom, /Users/runner/work/kotlin-binary-compatibility-validator-mu/kotlin-binary-compatibility-validator-mu/modules/bcv-gradle-plugin-functional-tests/build/tmp/functionalTest/work/.gradle-test-kit/caches/modules-2/files-2.1/org.jetbrains.kotlin/kotlin-android-extensions/1.7.20/644b486d050201ba77dcb4c5b34c88d98a3889e6/kotlin-android-extensions-1.7.20.pom]
Found locally available resource with matching checksum: [https://plugins.gradle.org/m2/org/jetbrains/kotlin/kotlin-compiler-runner/1.7.20/kotlin-compiler-runner-1.7.20.pom, /Users/runner/work/kotlin-binary-compatibility-validator-mu/kotlin-binary-compatibility-validator-mu/modules/bcv-gradle-plugin-functional-tests/build/tmp/functionalTest/work/.gradle-test-kit/caches/modules-2/files-2.1/org.jetbrains.kotlin/kotlin-compiler-runner/1.7.20/fa32748b5e248c0e486517b3136dfd05150b083d/kotlin-compiler-runner-1.7.20.pom]
Found locally available resource with matching checksum: [https://plugins.gradle.org/m2/org/jetbrains/kotlin/kotlin-scripting-compiler-embeddable/1.7.20/kotlin-scripting-compiler-embeddable-1.7.20.pom, /Users/runner/work/kotlin-binary-compatibility-validator-mu/kotlin-binary-compatibility-validator-mu/modules/bcv-gradle-plugin-functional-tests/build/tmp/functionalTest/work/.gradle-test-kit/caches/modules-2/files-2.1/org.jetbrains.kotlin/kotlin-scripting-compiler-embeddable/1.7.20/914115ed0e791339d37185828895e958a98a84ea/kotlin-scripting-compiler-embeddable-1.7.20.pom]
Found locally available resource with matching checksum: [https://plugins.gradle.org/m2/org/jetbrains/kotlin/kotlin-scripting-compiler-impl-embeddable/1.7.20/kotlin-scripting-compiler-impl-embeddable-1.7.20.pom, /Users/runner/work/kotlin-binary-compatibility-validator-mu/kotlin-binary-compatibility-validator-mu/modules/bcv-gradle-plugin-functional-tests/build/tmp/functionalTest/work/.gradle-test-kit/caches/modules-2/files-2.1/org.jetbrains.kotlin/kotlin-scripting-compiler-impl-embeddable/1.7.20/65ffddd9ccb77cfb079e6c8cfc0c61f4851435e/kotlin-scripting-compiler-impl-embeddable-1.7.20.pom]
Found locally available resource with matching checksum: [https://plugins.gradle.org/m2/io/github/java-diff-utils/java-diff-utils/4.16/java-diff-utils-4.16.pom, /Users/runner/.gradle/caches/modules-2/files-2.1/io.github.java-diff-utils/java-diff-utils/4.16/fa0e97d443aa07e38516deb25a3a39a5f392e62e/java-diff-utils-4.16.pom]
Found locally available resource with matching checksum: [https://plugins.gradle.org/m2/io/github/java-diff-utils/java-diff-utils-parent/4.16/java-diff-utils-parent-4.16.pom, /Users/runner/.gradle/caches/modules-2/files-2.1/io.github.java-diff-utils/java-diff-utils-parent/4.16/3025d76ac6d1a3875eb3d4a34d8f8c3bbb1de4d2/java-diff-utils-parent-4.16.pom]
Found locally available resource with matching checksum: [https://plugins.gradle.org/m2/org/jetbrains/kotlin/kotlin-native-utils/1.7.20/kotlin-native-utils-1.7.20.pom, /Users/runner/work/kotlin-binary-compatibility-validator-mu/kotlin-binary-compatibility-validator-mu/modules/bcv-gradle-plugin-functional-tests/build/tmp/functionalTest/work/.gradle-test-kit/caches/modules-2/files-2.1/org.jetbrains.kotlin/kotlin-native-utils/1.7.20/49c85bdfa26ac677359bfceee3bc8f09ff1a3dde/kotlin-native-utils-1.7.20.pom]
Found locally available resource with matching checksum: [https://plugins.gradle.org/m2/org/jetbrains/kotlin/kotlin-util-io/1.7.20/kotlin-util-io-1.7.20.pom, /Users/runner/work/kotlin-binary-compatibility-validator-mu/kotlin-binary-compatibility-validator-mu/modules/bcv-gradle-plugin-functional-tests/build/tmp/functionalTest/work/.gradle-test-kit/caches/modules-2/files-2.1/org.jetbrains.kotlin/kotlin-util-io/1.7.20/bf528d886b90dca60ff8dc2427cb262090ebecb/kotlin-util-io-1.7.20.pom]
Found locally available resource with matching checksum: [https://plugins.gradle.org/m2/org/jetbrains/kotlin/kotlin-daemon-embeddable/1.7.20/kotlin-daemon-embeddable-1.7.20.pom, /Users/runner/work/kotlin-binary-compatibility-validator-mu/kotlin-binary-compatibility-validator-mu/modules/bcv-gradle-plugin-functional-tests/build/tmp/functionalTest/work/.gradle-test-kit/caches/modules-2/files-2.1/org.jetbrains.kotlin/kotlin-daemon-embeddable/1.7.20/c3b3000b5ddc66e38c3d6bc8ed9b45092efe21ad/kotlin-daemon-embeddable-1.7.20.pom]
Found locally available resource with matching checksum: [https://plugins.gradle.org/m2/org/jetbrains/intellij/deps/trove4j/1.0.20200330/trove4j-1.0.20200330.pom, /Users/runner/.gradle/caches/modules-2/files-2.1/org.jetbrains.intellij.deps/trove4j/1.0.20200330/c1f38f72d4dfc6efd773b0448a7aae08f8d5025f/trove4j-1.0.20200330.pom]
Found locally available resource with matching checksum: [https://plugins.gradle.org/m2/net/java/dev/jna/jna/5.6.0/jna-5.6.0.pom, /Users/runner/work/kotlin-binary-compatibility-validator-mu/kotlin-binary-compatibility-validator-mu/modules/bcv-gradle-plugin-functional-tests/build/tmp/functionalTest/work/.gradle-test-kit/caches/modules-2/files-2.1/net.java.dev.jna/jna/5.6.0/e542808a6326ec0302c0b09011cb4363e1ece380/jna-5.6.0.pom]
Found locally available resource with matching checksum: [https://plugins.gradle.org/m2/org/jetbrains/kotlin/kotlin-build-common/1.7.20/kotlin-build-common-1.7.20.pom, /Users/runner/work/kotlin-binary-compatibility-validator-mu/kotlin-binary-compatibility-validator-mu/modules/bcv-gradle-plugin-functional-tests/build/tmp/functionalTest/work/.gradle-test-kit/caches/modules-2/files-2.1/org.jetbrains.kotlin/kotlin-build-common/1.7.20/4e3f5a47c901edb21953ede295b97319b494823d/kotlin-build-common-1.7.20.pom]
Found locally available resource with matching checksum: [https://plugins.gradle.org/m2/org/jetbrains/kotlin/kotlin-daemon-client/1.7.20/kotlin-daemon-client-1.7.20.pom, /Users/runner/work/kotlin-binary-compatibility-validator-mu/kotlin-binary-compatibility-validator-mu/modules/bcv-gradle-plugin-functional-tests/build/tmp/functionalTest/work/.gradle-test-kit/caches/modules-2/files-2.1/org.jetbrains.kotlin/kotlin-daemon-client/1.7.20/d3b9115c9d8e90b9dbac5b1c66d106b9f95aedcd/kotlin-daemon-client-1.7.20.pom]
Found locally available resource with matching checksum: [https://plugins.gradle.org/m2/org/jetbrains/kotlinx/kotlinx-coroutines-core-jvm/1.5.0/kotlinx-coroutines-core-jvm-1.5.0.pom, /Users/runner/work/kotlin-binary-compatibility-validator-mu/kotlin-binary-compatibility-validator-mu/modules/bcv-gradle-plugin-functional-tests/build/tmp/functionalTest/work/.gradle-test-kit/caches/modules-2/files-2.1/org.jetbrains.kotlinx/kotlinx-coroutines-core-jvm/1.5.0/8b1169a630a788212949fe4c74043cc18be763fe/kotlinx-coroutines-core-jvm-1.5.0.pom]
Found locally available resource with matching checksum: [https://plugins.gradle.org/m2/org/jetbrains/kotlinx/kotlinx-coroutines-core-jvm/1.5.0/kotlinx-coroutines-core-jvm-1.5.0.module, /Users/runner/work/kotlin-binary-compatibility-validator-mu/kotlin-binary-compatibility-validator-mu/modules/bcv-gradle-plugin-functional-tests/build/tmp/functionalTest/work/.gradle-test-kit/caches/modules-2/files-2.1/org.jetbrains.kotlinx/kotlinx-coroutines-core-jvm/1.5.0/49d762d8bf90e3eb7d5593eb554aa7e582a5af3f/kotlinx-coroutines-core-jvm-1.5.0.module]
Found locally available resource with matching checksum: [https://plugins.gradle.org/m2/org/jetbrains/kotlin/kotlin-scripting-common/1.7.20/kotlin-scripting-common-1.7.20.pom, /Users/runner/work/kotlin-binary-compatibility-validator-mu/kotlin-binary-compatibility-validator-mu/modules/bcv-gradle-plugin-functional-tests/build/tmp/functionalTest/work/.gradle-test-kit/caches/modules-2/files-2.1/org.jetbrains.kotlin/kotlin-scripting-common/1.7.20/b70f23e62f968dde5ddb6ff79147e7468a246257/kotlin-scripting-common-1.7.20.pom]
Found locally available resource with matching checksum: [https://plugins.gradle.org/m2/org/jetbrains/kotlin/kotlin-scripting-jvm/1.7.20/kotlin-scripting-jvm-1.7.20.pom, /Users/runner/work/kotlin-binary-compatibility-validator-mu/kotlin-binary-compatibility-validator-mu/modules/bcv-gradle-plugin-functional-tests/build/tmp/functionalTest/work/.gradle-test-kit/caches/modules-2/files-2.1/org.jetbrains.kotlin/kotlin-scripting-jvm/1.7.20/224cb3bc59483d53f731d95aa1961242adc3363f/kotlin-scripting-jvm-1.7.20.pom]
Resource missing. [HTTP HEAD: https://plugins.gradle.org/m2/org/jetbrains/kotlin/jvm/org.jetbrains.kotlin.jvm.gradle.plugin/1.7.20/org.jetbrains.kotlin.jvm.gradle.plugin-1.7.20.jar]
Found locally available resource with matching checksum: [https://plugins.gradle.org/m2/org/jetbrains/kotlin/kotlin-gradle-plugin-idea/1.7.20/kotlin-gradle-plugin-idea-1.7.20.jar, /Users/runner/work/kotlin-binary-compatibility-validator-mu/kotlin-binary-compatibility-validator-mu/modules/bcv-gradle-plugin-functional-tests/build/tmp/functionalTest/work/.gradle-test-kit/caches/modules-2/files-2.1/org.jetbrains.kotlin/kotlin-gradle-plugin-idea/1.7.20/47cde176ecd0fcf5a8ef2a5d0a020372bf69bb93/kotlin-gradle-plugin-idea-1.7.20.jar]
Found locally available resource with matching checksum: [https://plugins.gradle.org/m2/org/jetbrains/kotlin/kotlin-gradle-plugin-idea-proto/1.7.20/kotlin-gradle-plugin-idea-proto-1.7.20.jar, /Users/runner/work/kotlin-binary-compatibility-validator-mu/kotlin-binary-compatibility-validator-mu/modules/bcv-gradle-plugin-functional-tests/build/tmp/functionalTest/work/.gradle-test-kit/caches/modules-2/files-2.1/org.jetbrains.kotlin/kotlin-gradle-plugin-idea-proto/1.7.20/8af2b6cab9bc0babdb32d4c88a4439b68ef7760/kotlin-gradle-plugin-idea-proto-1.7.20.jar]
Failed to get resource: HEAD. [HTTP HTTP/1.1 503 Service Unavailable: https://plugins.gradle.org/m2/org/jetbrains/kotlin/kotlin-gradle-plugin-api/1.7.20/kotlin-gradle-plugin-api-1.7.20-gradle71.jar)]
Found locally available resource with matching checksum: [https://plugins.gradle.org/m2/org/jetbrains/kotlin/kotlin-scripting-common/1.7.20/kotlin-scripting-common-1.7.20.jar, /Users/runner/work/kotlin-binary-compatibility-validator-mu/kotlin-binary-compatibility-validator-mu/modules/bcv-gradle-plugin-functional-tests/build/tmp/functionalTest/work/.gradle-test-kit/caches/modules-2/files-2.1/org.jetbrains.kotlin/kotlin-scripting-common/1.7.20/88ed4f0a92a48e12d2d4596f26967400e390648c/kotlin-scripting-common-1.7.20.jar]
Found locally available resource with matching checksum: [https://plugins.gradle.org/m2/org/jetbrains/kotlin/kotlin-gradle-plugin/1.7.20/kotlin-gradle-plugin-1.7.20-gradle71.jar, /Users/runner/work/kotlin-binary-compatibility-validator-mu/kotlin-binary-compatibility-validator-mu/modules/bcv-gradle-plugin-functional-tests/build/tmp/functionalTest/work/.gradle-test-kit/caches/modules-2/files-2.1/org.jetbrains.kotlin/kotlin-gradle-plugin/1.7.20/d08f039d97cd489e3fbf19e5f855deee35297bd4/kotlin-gradle-plugin-1.7.20-gradle71.jar]
Found locally available resource with matching checksum: [https://plugins.gradle.org/m2/org/jetbrains/kotlin/kotlin-project-model/1.7.20/kotlin-project-model-1.7.20.jar, /Users/runner/work/kotlin-binary-compatibility-validator-mu/kotlin-binary-compatibility-validator-mu/modules/bcv-gradle-plugin-functional-tests/build/tmp/functionalTest/work/.gradle-test-kit/caches/modules-2/files-2.1/org.jetbrains.kotlin/kotlin-project-model/1.7.20/8db9bd1b28e2fefd67727adecb96462f7d454a39/kotlin-project-model-1.7.20.jar]
Found locally available resource with matching checksum: [https://plugins.gradle.org/m2/org/jetbrains/kotlin/kotlin-scripting-jvm/1.7.20/kotlin-scripting-jvm-1.7.20.jar, /Users/runner/work/kotlin-binary-compatibility-validator-mu/kotlin-binary-compatibility-validator-mu/modules/bcv-gradle-plugin-functional-tests/build/tmp/functionalTest/work/.gradle-test-kit/caches/modules-2/files-2.1/org.jetbrains.kotlin/kotlin-scripting-jvm/1.7.20/c79de17329ea8f7c7d200063145d5694ca3f6786/kotlin-scripting-jvm-1.7.20.jar]
Found locally available resource with matching checksum: [https://plugins.gradle.org/m2/org/jetbrains/kotlin/kotlin-gradle-plugin-model/1.7.20/kotlin-gradle-plugin-model-1.7.20.jar, /Users/runner/work/kotlin-binary-compatibility-validator-mu/kotlin-binary-compatibility-validator-mu/modules/bcv-gradle-plugin-functional-tests/build/tmp/functionalTest/work/.gradle-test-kit/caches/modules-2/files-2.1/org.jetbrains.kotlin/kotlin-gradle-plugin-model/1.7.20/ee10b25667d827bc6c2f2520fa43e1a5079ed151/kotlin-gradle-plugin-model-1.7.20.jar]
Found locally available resource with matching checksum: [https://plugins.gradle.org/m2/org/jetbrains/kotlinx/kotlinx-coroutines-core-jvm/1.5.0/kotlinx-coroutines-core-jvm-1.5.0.jar, /Users/runner/work/kotlin-binary-compatibility-validator-mu/kotlin-binary-compatibility-validator-mu/modules/bcv-gradle-plugin-functional-tests/build/tmp/functionalTest/work/.gradle-test-kit/caches/modules-2/files-2.1/org.jetbrains.kotlinx/kotlinx-coroutines-core-jvm/1.5.0/d8cebccdcddd029022aa8646a5a953ff88b13ac8/kotlinx-coroutines-core-jvm-1.5.0.jar]
Found locally available resource with matching checksum: [https://plugins.gradle.org/m2/org/jetbrains/kotlin/kotlin-tooling-core/1.7.20/kotlin-tooling-core-1.7.20.jar, /Users/runner/work/kotlin-binary-compatibility-validator-mu/kotlin-binary-compatibility-validator-mu/modules/bcv-gradle-plugin-functional-tests/build/tmp/functionalTest/work/.gradle-test-kit/caches/modules-2/files-2.1/org.jetbrains.kotlin/kotlin-tooling-core/1.7.20/19c84dd609449479dd647cfb8b885f6430501a21/kotlin-tooling-core-1.7.20.jar]
Found locally available resource with matching checksum: [https://plugins.gradle.org/m2/org/jetbrains/kotlin/kotlin-util-klib/1.7.20/kotlin-util-klib-1.7.20.jar, /Users/runner/work/kotlin-binary-compatibility-validator-mu/kotlin-binary-compatibility-validator-mu/modules/bcv-gradle-plugin-functional-tests/build/tmp/functionalTest/work/.gradle-test-kit/caches/modules-2/files-2.1/org.jetbrains.kotlin/kotlin-util-klib/1.7.20/9df574f921e0339d4b8ef925e11e34a111a571b1/kotlin-util-klib-1.7.20.jar]
Found locally available resource with matching checksum: [https://plugins.gradle.org/m2/org/jetbrains/kotlin/kotlin-daemon-client/1.7.20/kotlin-daemon-client-1.7.20.jar, /Users/runner/work/kotlin-binary-compatibility-validator-mu/kotlin-binary-compatibility-validator-mu/modules/bcv-gradle-plugin-functional-tests/build/tmp/functionalTest/work/.gradle-test-kit/caches/modules-2/files-2.1/org.jetbrains.kotlin/kotlin-daemon-client/1.7.20/15d93f39cb060c1976b02e9e99d215c5765ecad/kotlin-daemon-client-1.7.20.jar]
Found locally available resource with matching checksum: [https://plugins.gradle.org/m2/org/jetbrains/kotlin/kotlin-build-common/1.7.20/kotlin-build-common-1.7.20.jar, /Users/runner/work/kotlin-binary-compatibility-validator-mu/kotlin-binary-compatibility-validator-mu/modules/bcv-gradle-plugin-functional-tests/build/tmp/functionalTest/work/.gradle-test-kit/caches/modules-2/files-2.1/org.jetbrains.kotlin/kotlin-build-common/1.7.20/edf73ec21410f29ef755f346bb9f8dbca8f04263/kotlin-build-common-1.7.20.jar]
Found locally available resource with matching checksum: [https://plugins.gradle.org/m2/net/java/dev/jna/jna/5.6.0/jna-5.6.0.jar, /Users/runner/work/kotlin-binary-compatibility-validator-mu/kotlin-binary-compatibility-validator-mu/modules/bcv-gradle-plugin-functional-tests/build/tmp/functionalTest/work/.gradle-test-kit/caches/modules-2/files-2.1/net.java.dev.jna/jna/5.6.0/330f2244e9030119ab3030fc3fededc86713d9cc/jna-5.6.0.jar]
Found locally available resource with matching checksum: [https://plugins.gradle.org/m2/org/jetbrains/kotlin/kotlin-gradle-plugin-api/1.7.20/kotlin-gradle-plugin-api-1.7.20.jar, /Users/runner/work/kotlin-binary-compatibility-validator-mu/kotlin-binary-compatibility-validator-mu/modules/bcv-gradle-plugin-functional-tests/build/tmp/functionalTest/work/.gradle-test-kit/caches/modules-2/files-2.1/org.jetbrains.kotlin/kotlin-gradle-plugin-api/1.7.20/8159de6c79ac1c91fe2ecc488c30b27b2a8f5f1c/kotlin-gradle-plugin-api-1.7.20.jar]
Found locally available resource with matching checksum: [https://plugins.gradle.org/m2/org/jetbrains/intellij/deps/trove4j/1.0.20200330/trove4j-1.0.20200330.jar, /Users/runner/.gradle/caches/modules-2/files-2.1/org.jetbrains.intellij.deps/trove4j/1.0.20200330/3afb14d5f9ceb459d724e907a21145e8ff394f02/trove4j-1.0.20200330.jar]
Found locally available resource with matching checksum: [https://plugins.gradle.org/m2/org/jetbrains/kotlin/kotlin-klib-commonizer-api/1.7.20/kotlin-klib-commonizer-api-1.7.20.jar, /Users/runner/work/kotlin-binary-compatibility-validator-mu/kotlin-binary-compatibility-validator-mu/modules/bcv-gradle-plugin-functional-tests/build/tmp/functionalTest/work/.gradle-test-kit/caches/modules-2/files-2.1/org.jetbrains.kotlin/kotlin-klib-commonizer-api/1.7.20/85639b70c215235da621fe4b25855c246373eddc/kotlin-klib-commonizer-api-1.7.20.jar]
Found locally available resource with matching checksum: [https://plugins.gradle.org/m2/org/jetbrains/kotlin/kotlin-daemon-embeddable/1.7.20/kotlin-daemon-embeddable-1.7.20.jar, /Users/runner/work/kotlin-binary-compatibility-validator-mu/kotlin-binary-compatibility-validator-mu/modules/bcv-gradle-plugin-functional-tests/build/tmp/functionalTest/work/.gradle-test-kit/caches/modules-2/files-2.1/org.jetbrains.kotlin/kotlin-daemon-embeddable/1.7.20/1e24355adad8d529d75d5b19eab55484057431ba/kotlin-daemon-embeddable-1.7.20.jar]
Found locally available resource with matching checksum: [https://plugins.gradle.org/m2/org/jetbrains/kotlin/kotlin-annotation-processing-gradle/1.7.20/kotlin-annotation-processing-gradle-1.7.20.jar, /Users/runner/work/kotlin-binary-compatibility-validator-mu/kotlin-binary-compatibility-validator-mu/modules/bcv-gradle-plugin-functional-tests/build/tmp/functionalTest/work/.gradle-test-kit/caches/modules-2/files-2.1/org.jetbrains.kotlin/kotlin-annotation-processing-gradle/1.7.20/e35259bb0659543102a3af44640567634abea257/kotlin-annotation-processing-gradle-1.7.20.jar]
Found locally available resource with matching checksum: [https://plugins.gradle.org/m2/org/jetbrains/kotlin/kotlin-native-utils/1.7.20/kotlin-native-utils-1.7.20.jar, /Users/runner/work/kotlin-binary-compatibility-validator-mu/kotlin-binary-compatibility-validator-mu/modules/bcv-gradle-plugin-functional-tests/build/tmp/functionalTest/work/.gradle-test-kit/caches/modules-2/files-2.1/org.jetbrains.kotlin/kotlin-native-utils/1.7.20/8e64e54cf3fb0c275b3f2f5a9276110fbb329f8f/kotlin-native-utils-1.7.20.jar]
Found locally available resource with matching checksum: [https://plugins.gradle.org/m2/org/jetbrains/kotlin/kotlin-android-extensions/1.7.20/kotlin-android-extensions-1.7.20.jar, /Users/runner/work/kotlin-binary-compatibility-validator-mu/kotlin-binary-compatibility-validator-mu/modules/bcv-gradle-plugin-functional-tests/build/tmp/functionalTest/work/.gradle-test-kit/caches/modules-2/files-2.1/org.jetbrains.kotlin/kotlin-android-extensions/1.7.20/af6872dd3ef582956d8cf477e68ef63b0428dd3c/kotlin-android-extensions-1.7.20.jar]
Found locally available resource with matching checksum: [https://plugins.gradle.org/m2/org/jetbrains/kotlin/kotlin-util-io/1.7.20/kotlin-util-io-1.7.20.jar, /Users/runner/work/kotlin-binary-compatibility-validator-mu/kotlin-binary-compatibility-validator-mu/modules/bcv-gradle-plugin-functional-tests/build/tmp/functionalTest/work/.gradle-test-kit/caches/modules-2/files-2.1/org.jetbrains.kotlin/kotlin-util-io/1.7.20/6e11b33883defb7ca4b8bff8c5fe81e463803bc7/kotlin-util-io-1.7.20.jar]
Found locally available resource with matching checksum: [https://plugins.gradle.org/m2/org/jetbrains/kotlin/kotlin-compiler-runner/1.7.20/kotlin-compiler-runner-1.7.20.jar, /Users/runner/work/kotlin-binary-compatibility-validator-mu/kotlin-binary-compatibility-validator-mu/modules/bcv-gradle-plugin-functional-tests/build/tmp/functionalTest/work/.gradle-test-kit/caches/modules-2/files-2.1/org.jetbrains.kotlin/kotlin-compiler-runner/1.7.20/13e2e19c406d4b20d29011740fdf720a4c542636/kotlin-compiler-runner-1.7.20.jar]
Found locally available resource with matching checksum: [https://plugins.gradle.org/m2/org/jetbrains/kotlin/kotlin-scripting-compiler-impl-embeddable/1.7.20/kotlin-scripting-compiler-impl-embeddable-1.7.20.jar, /Users/runner/work/kotlin-binary-compatibility-validator-mu/kotlin-binary-compatibility-validator-mu/modules/bcv-gradle-plugin-functional-tests/build/tmp/functionalTest/work/.gradle-test-kit/caches/modules-2/files-2.1/org.jetbrains.kotlin/kotlin-scripting-compiler-impl-embeddable/1.7.20/9a40e21c6710aca281217963ef137c7df945e1bc/kotlin-scripting-compiler-impl-embeddable-1.7.20.jar]
Found locally available resource with matching checksum: [https://plugins.gradle.org/m2/io/github/java-diff-utils/java-diff-utils/4.16/java-diff-utils-4.16.jar, /Users/runner/.gradle/caches/modules-2/files-2.1/io.github.java-diff-utils/java-diff-utils/4.16/cca1e7dc2460d0afeebc3fc4a3386eadede08c5a/java-diff-utils-4.16.jar]
Found locally available resource with matching checksum: [https://plugins.gradle.org/m2/org/jetbrains/kotlin/kotlin-scripting-compiler-embeddable/1.7.20/kotlin-scripting-compiler-embeddable-1.7.20.jar, /Users/runner/work/kotlin-binary-compatibility-validator-mu/kotlin-binary-compatibility-validator-mu/modules/bcv-gradle-plugin-functional-tests/build/tmp/functionalTest/work/.gradle-test-kit/caches/modules-2/files-2.1/org.jetbrains.kotlin/kotlin-scripting-compiler-embeddable/1.7.20/a7f1cf58156c0e066411f4f7fd26cb8c63e11aca/kotlin-scripting-compiler-embeddable-1.7.20.jar]
Found locally available resource with matching checksum: [https://plugins.gradle.org/m2/org/jetbrains/kotlin/kotlin-compiler-embeddable/1.7.20/kotlin-compiler-embeddable-1.7.20.jar, /Users/runner/work/kotlin-binary-compatibility-validator-mu/kotlin-binary-compatibility-validator-mu/modules/bcv-gradle-plugin-functional-tests/build/tmp/functionalTest/work/.gradle-test-kit/caches/modules-2/files-2.1/org.jetbrains.kotlin/kotlin-compiler-embeddable/1.7.20/8db18559a581dd2c36ddfd5046af145650f5b126/kotlin-compiler-embeddable-1.7.20.jar]
Failed to get resource: HEAD. [HTTP HTTP/1.1 503 Service Unavailable: https://plugins.gradle.org/m2/org/jetbrains/kotlin/kotlin-gradle-plugin-api/1.7.20/kotlin-gradle-plugin-api-1.7.20-gradle71.jar)]
Failed to get resource: HEAD. [HTTP HTTP/1.1 503 Service Unavailable: https://plugins.gradle.org/m2/org/jetbrains/kotlin/kotlin-gradle-plugin-api/1.7.20/kotlin-gradle-plugin-api-1.7.20-gradle71.jar)]
FAILURE: Build failed with an exception.
* What went wrong:
A problem occurred configuring root project 'junit-7598292866618652539'.
> Could not resolve all files for configuration ':classpath'.
> Could not download kotlin-gradle-plugin-api-1.7.20-gradle71.jar (org.jetbrains.kotlin:kotlin-gradle-plugin-api:1.7.20)
> Could not get resource 'https://plugins.gradle.org/m2/org/jetbrains/kotlin/kotlin-gradle-plugin-api/1.7.20/kotlin-gradle-plugin-api-1.7.20-gradle71.jar'.
> Could not HEAD 'https://plugins.gradle.org/m2/org/jetbrains/kotlin/kotlin-gradle-plugin-api/1.7.20/kotlin-gradle-plugin-api-1.7.20-gradle71.jar'. Received status code 503 from server: Service Unavailable
* Try:
> Run with --debug option to get more log output.
> Run with --scan to get full insights.
* Exception is:
org.gradle.api.ProjectConfigurationException: A problem occurred configuring root project 'junit-7598292866618652539'.
at org.gradle.configuration.project.LifecycleProjectEvaluator.wrapException(LifecycleProjectEvaluator.java:84)
at org.gradle.configuration.project.LifecycleProjectEvaluator.addConfigurationFailure(LifecycleProjectEvaluator.java:77)
at org.gradle.configuration.project.LifecycleProjectEvaluator.access$400(LifecycleProjectEvaluator.java:55)
at org.gradle.configuration.project.LifecycleProjectEvaluator$EvaluateProject.lambda$run$0(LifecycleProjectEvaluator.java:111)
at org.gradle.api.internal.project.DefaultProjectStateRegistry$ProjectStateImpl.lambda$applyToMutableState$0(DefaultProjectStateRegistry.java:360)
at org.gradle.api.internal.project.DefaultProjectStateRegistry$ProjectStateImpl.lambda$fromMutableState$1(DefaultProjectStateRegistry.java:383)
at org.gradle.internal.work.DefaultWorkerLeaseService.withReplacedLocks(DefaultWorkerLeaseService.java:345)
at org.gradle.api.internal.project.DefaultProjectStateRegistry$ProjectStateImpl.fromMutableState(DefaultProjectStateRegistry.java:383)
at org.gradle.api.internal.project.DefaultProjectStateRegistry$ProjectStateImpl.applyToMutableState(DefaultProjectStateRegistry.java:359)
at org.gradle.configuration.project.LifecycleProjectEvaluator$EvaluateProject.run(LifecycleProjectEvaluator.java:100)
at org.gradle.internal.operations.DefaultBuildOperationRunner$1.execute(DefaultBuildOperationRunner.java:29)
at org.gradle.internal.operations.DefaultBuildOperationRunner$1.execute(DefaultBuildOperationRunner.java:26)
at org.gradle.internal.operations.DefaultBuildOperationRunner$2.execute(DefaultBuildOperationRunner.java:66)
at org.gradle.internal.operations.DefaultBuildOperationRunner$2.execute(DefaultBuildOperationRunner.java:59)
at org.gradle.internal.operations.DefaultBuildOperationRunner.execute(DefaultBuildOperationRunner.java:157)
at org.gradle.internal.operations.DefaultBuildOperationRunner.execute(DefaultBuildOperationRunner.java:59)
at org.gradle.internal.operations.DefaultBuildOperationRunner.run(DefaultBuildOperationRunner.java:47)
at org.gradle.internal.operations.DefaultBuildOperationExecutor.run(DefaultBuildOperationExecutor.java:68)
at org.gradle.configuration.project.LifecycleProjectEvaluator.evaluate(LifecycleProjectEvaluator.java:72)
at org.gradle.api.internal.project.DefaultProject.evaluate(DefaultProject.java:762)
at org.gradle.api.internal.project.DefaultProject.evaluate(DefaultProject.java:153)
at org.gradle.api.internal.project.ProjectLifecycleController.lambda$ensureSelfConfigured$1(ProjectLifecycleController.java:63)
at org.gradle.internal.model.StateTransitionController.lambda$doTransition$12(StateTransitionController.java:236)
at org.gradle.internal.model.StateTransitionController.doTransition(StateTransitionController.java:247)
at org.gradle.internal.model.StateTransitionController.doTransition(StateTransitionController.java:235)
at org.gradle.internal.model.StateTransitionController.lambda$maybeTransitionIfNotCurrentlyTransitioning$9(StateTransitionController.java:196)
at org.gradle.internal.work.DefaultSynchronizer.withLock(DefaultSynchronizer.java:34)
at org.gradle.internal.model.StateTransitionController.maybeTransitionIfNotCurrentlyTransitioning(StateTransitionController.java:192)
at org.gradle.api.internal.project.ProjectLifecycleController.ensureSelfConfigured(ProjectLifecycleController.java:63)
at org.gradle.api.internal.project.DefaultProjectStateRegistry$ProjectStateImpl.ensureConfigured(DefaultProjectStateRegistry.java:334)
at org.gradle.execution.TaskPathProjectEvaluator.configure(TaskPathProjectEvaluator.java:33)
at org.gradle.execution.TaskPathProjectEvaluator.configureHierarchy(TaskPathProjectEvaluator.java:47)
at org.gradle.configuration.DefaultProjectsPreparer.prepareProjects(DefaultProjectsPreparer.java:50)
at org.gradle.configuration.BuildTreePreparingProjectsPreparer.prepareProjects(BuildTreePreparingProjectsPreparer.java:64)
at org.gradle.configuration.BuildOperationFiringProjectsPreparer$ConfigureBuild.run(BuildOperationFiringProjectsPreparer.java:52)
at org.gradle.internal.operations.DefaultBuildOperationRunner$1.execute(DefaultBuildOperationRunner.java:29)
at org.gradle.internal.operations.DefaultBuildOperationRunner$1.execute(DefaultBuildOperationRunner.java:26)
at org.gradle.internal.operations.DefaultBuildOperationRunner$2.execute(DefaultBuildOperationRunner.java:66)
at org.gradle.internal.operations.DefaultBuildOperationRunner$2.execute(DefaultBuildOperationRunner.java:59)
at org.gradle.internal.operations.DefaultBuildOperationRunner.execute(DefaultBuildOperationRunner.java:157)
at org.gradle.internal.operations.DefaultBuildOperationRunner.execute(DefaultBuildOperationRunner.java:59)
at org.gradle.internal.operations.DefaultBuildOperationRunner.run(DefaultBuildOperationRunner.java:47)
at org.gradle.internal.operations.DefaultBuildOperationExecutor.run(DefaultBuildOperationExecutor.java:68)
at org.gradle.configuration.BuildOperationFiringProjectsPreparer.prepareProjects(BuildOperationFiringProjectsPreparer.java:40)
at org.gradle.initialization.VintageBuildModelController.lambda$prepareProjects$2(VintageBuildModelController.java:84)
at org.gradle.internal.model.StateTransitionController.lambda$doTransition$12(StateTransitionController.java:236)
at org.gradle.internal.model.StateTransitionController.doTransition(StateTransitionController.java:247)
at org.gradle.internal.model.StateTransitionController.doTransition(StateTransitionController.java:235)
at org.gradle.internal.model.StateTransitionController.lambda$transitionIfNotPreviously$10(StateTransitionController.java:210)
at org.gradle.internal.work.DefaultSynchronizer.withLock(DefaultSynchronizer.java:34)
at org.gradle.internal.model.StateTransitionController.transitionIfNotPreviously(StateTransitionController.java:206)
at org.gradle.initialization.VintageBuildModelController.prepareProjects(VintageBuildModelController.java:84)
at org.gradle.initialization.VintageBuildModelController.prepareToScheduleTasks(VintageBuildModelController.java:71)
at org.gradle.configurationcache.ConfigurationCacheAwareBuildModelController.prepareToScheduleTasks(ConfigurationCacheAwareBuildModelController.kt:49)
at org.gradle.internal.build.DefaultBuildLifecycleController.lambda$prepareToScheduleTasks$2(DefaultBuildLifecycleController.java:129)
at org.gradle.internal.model.StateTransitionController.lambda$doTransition$12(StateTransitionController.java:236)
at org.gradle.internal.model.StateTransitionController.doTransition(StateTransitionController.java:247)
at org.gradle.internal.model.StateTransitionController.doTransition(StateTransitionController.java:235)
at org.gradle.internal.model.StateTransitionController.lambda$maybeTransition$8(StateTransitionController.java:187)
at org.gradle.internal.work.DefaultSynchronizer.withLock(DefaultSynchronizer.java:34)
at org.gradle.internal.model.StateTransitionController.maybeTransition(StateTransitionController.java:183)
at org.gradle.internal.build.DefaultBuildLifecycleController.prepareToScheduleTasks(DefaultBuildLifecycleController.java:127)
at org.gradle.internal.buildtree.DefaultBuildTreeWorkPreparer.scheduleRequestedTasks(DefaultBuildTreeWorkPreparer.java:36)
at org.gradle.configurationcache.ConfigurationCacheAwareBuildTreeWorkPreparer$scheduleRequestedTasks$1.invoke(ConfigurationCacheAwareBuildTreeWorkPreparer.kt:30)
at org.gradle.configurationcache.ConfigurationCacheAwareBuildTreeWorkPreparer$scheduleRequestedTasks$1.invoke(ConfigurationCacheAwareBuildTreeWorkPreparer.kt:29)
at org.gradle.configurationcache.DefaultConfigurationCache$loadOrScheduleRequestedTasks$1.invoke(DefaultConfigurationCache.kt:133)
at org.gradle.configurationcache.DefaultConfigurationCache$loadOrScheduleRequestedTasks$1.invoke(DefaultConfigurationCache.kt:132)
at org.gradle.configurationcache.DefaultConfigurationCache.runWorkThatContributesToCacheEntry(DefaultConfigurationCache.kt:284)
at org.gradle.configurationcache.DefaultConfigurationCache.loadOrScheduleRequestedTasks(DefaultConfigurationCache.kt:132)
at org.gradle.configurationcache.ConfigurationCacheAwareBuildTreeWorkPreparer.scheduleRequestedTasks(ConfigurationCacheAwareBuildTreeWorkPreparer.kt:29)
at org.gradle.internal.buildtree.DefaultBuildTreeLifecycleController.lambda$doScheduleAndRunTasks$3(DefaultBuildTreeLifecycleController.java:96)
at org.gradle.composite.internal.DefaultIncludedBuildTaskGraph.withNewWorkGraph(DefaultIncludedBuildTaskGraph.java:109)
at org.gradle.internal.buildtree.DefaultBuildTreeLifecycleController.doScheduleAndRunTasks(DefaultBuildTreeLifecycleController.java:95)
at org.gradle.internal.buildtree.DefaultBuildTreeLifecycleController.lambda$scheduleAndRunTasks$1(DefaultBuildTreeLifecycleController.java:76)
at org.gradle.internal.buildtree.DefaultBuildTreeLifecycleController.lambda$runBuild$5(DefaultBuildTreeLifecycleController.java:113)
at org.gradle.internal.model.StateTransitionController.lambda$transition$5(StateTransitionController.java:166)
at org.gradle.internal.model.StateTransitionController.doTransition(StateTransitionController.java:247)
at org.gradle.internal.model.StateTransitionController.lambda$transition$6(StateTransitionController.java:166)
at org.gradle.internal.work.DefaultSynchronizer.withLock(DefaultSynchronizer.java:44)
at org.gradle.internal.model.StateTransitionController.transition(StateTransitionController.java:166)
at org.gradle.internal.buildtree.DefaultBuildTreeLifecycleController.runBuild(DefaultBuildTreeLifecycleController.java:110)
at org.gradle.internal.buildtree.DefaultBuildTreeLifecycleController.scheduleAndRunTasks(DefaultBuildTreeLifecycleController.java:76)
at org.gradle.internal.buildtree.DefaultBuildTreeLifecycleController.scheduleAndRunTasks(DefaultBuildTreeLifecycleController.java:71)
at org.gradle.tooling.internal.provider.runner.BuildModelActionRunner.run(BuildModelActionRunner.java:53)
at org.gradle.launcher.exec.ChainingBuildActionRunner.run(ChainingBuildActionRunner.java:35)
at org.gradle.internal.buildtree.ProblemReportingBuildActionRunner.run(ProblemReportingBuildActionRunner.java:49)
at org.gradle.launcher.exec.BuildOutcomeReportingBuildActionRunner.run(BuildOutcomeReportingBuildActionRunner.java:65)
at org.gradle.tooling.internal.provider.FileSystemWatchingBuildActionRunner.run(FileSystemWatchingBuildActionRunner.java:136)
at org.gradle.launcher.exec.BuildCompletionNotifyingBuildActionRunner.run(BuildCompletionNotifyingBuildActionRunner.java:41)
at org.gradle.launcher.exec.RootBuildLifecycleBuildActionExecutor.lambda$execute$0(RootBuildLifecycleBuildActionExecutor.java:40)
at org.gradle.composite.internal.DefaultRootBuildState.run(DefaultRootBuildState.java:122)
at org.gradle.launcher.exec.RootBuildLifecycleBuildActionExecutor.execute(RootBuildLifecycleBuildActionExecutor.java:40)
at org.gradle.internal.buildtree.DefaultBuildTreeContext.execute(DefaultBuildTreeContext.java:40)
at org.gradle.launcher.exec.BuildTreeLifecycleBuildActionExecutor.lambda$execute$0(BuildTreeLifecycleBuildActionExecutor.java:65)
at org.gradle.internal.buildtree.BuildTreeState.run(BuildTreeState.java:53)
at org.gradle.launcher.exec.BuildTreeLifecycleBuildActionExecutor.execute(BuildTreeLifecycleBuildActionExecutor.java:65)
at org.gradle.launcher.exec.RunAsBuildOperationBuildActionExecutor$3.call(RunAsBuildOperationBuildActionExecutor.java:61)
at org.gradle.launcher.exec.RunAsBuildOperationBuildActionExecutor$3.call(RunAsBuildOperationBuildActionExecutor.java:57)
at org.gradle.internal.operations.DefaultBuildOperationRunner$CallableBuildOperationWorker.execute(DefaultBuildOperationRunner.java:204)
at org.gradle.internal.operations.DefaultBuildOperationRunner$CallableBuildOperationWorker.execute(DefaultBuildOperationRunner.java:199)
at org.gradle.internal.operations.DefaultBuildOperationRunner$2.execute(DefaultBuildOperationRunner.java:66)
at org.gradle.internal.operations.DefaultBuildOperationRunner$2.execute(DefaultBuildOperationRunner.java:59)
at org.gradle.internal.operations.DefaultBuildOperationRunner.execute(DefaultBuildOperationRunner.java:157)
at org.gradle.internal.operations.DefaultBuildOperationRunner.execute(DefaultBuildOperationRunner.java:59)
at org.gradle.internal.operations.DefaultBuildOperationRunner.call(DefaultBuildOperationRunner.java:53)
at org.gradle.internal.operations.DefaultBuildOperationExecutor.call(DefaultBuildOperationExecutor.java:73)
at org.gradle.launcher.exec.RunAsBuildOperationBuildActionExecutor.execute(RunAsBuildOperationBuildActionExecutor.java:57)
at org.gradle.launcher.exec.RunAsWorkerThreadBuildActionExecutor.lambda$execute$0(RunAsWorkerThreadBuildActionExecutor.java:36)
at org.gradle.internal.work.DefaultWorkerLeaseService.withLocks(DefaultWorkerLeaseService.java:249)
at org.gradle.internal.work.DefaultWorkerLeaseService.runAsWorkerThread(DefaultWorkerLeaseService.java:109)
at org.gradle.launcher.exec.RunAsWorkerThreadBuildActionExecutor.execute(RunAsWorkerThreadBuildActionExecutor.java:36)
at org.gradle.tooling.internal.provider.continuous.ContinuousBuildActionExecutor.execute(ContinuousBuildActionExecutor.java:110)
at org.gradle.tooling.internal.provider.SubscribableBuildActionExecutor.execute(SubscribableBuildActionExecutor.java:64)
at org.gradle.internal.session.DefaultBuildSessionContext.execute(DefaultBuildSessionContext.java:46)
at org.gradle.tooling.internal.provider.BuildSessionLifecycleBuildActionExecuter$ActionImpl.apply(BuildSessionLifecycleBuildActionExecuter.java:100)
at org.gradle.tooling.internal.provider.BuildSessionLifecycleBuildActionExecuter$ActionImpl.apply(BuildSessionLifecycleBuildActionExecuter.java:88)
at org.gradle.internal.session.BuildSessionState.run(BuildSessionState.java:69)
at org.gradle.tooling.internal.provider.BuildSessionLifecycleBuildActionExecuter.execute(BuildSessionLifecycleBuildActionExecuter.java:62)
at org.gradle.tooling.internal.provider.BuildSessionLifecycleBuildActionExecuter.execute(BuildSessionLifecycleBuildActionExecuter.java:41)
at org.gradle.tooling.internal.provider.StartParamsValidatingActionExecuter.execute(StartParamsValidatingActionExecuter.java:63)
at org.gradle.tooling.internal.provider.StartParamsValidatingActionExecuter.execute(StartParamsValidatingActionExecuter.java:31)
at org.gradle.tooling.internal.provider.SessionFailureReportingActionExecuter.execute(SessionFailureReportingActionExecuter.java:52)
at org.gradle.tooling.internal.provider.SessionFailureReportingActionExecuter.execute(SessionFailureReportingActionExecuter.java:40)
at org.gradle.tooling.internal.provider.SetupLoggingActionExecuter.execute(SetupLoggingActionExecuter.java:47)
at org.gradle.tooling.internal.provider.SetupLoggingActionExecuter.execute(SetupLoggingActionExecuter.java:31)
at org.gradle.launcher.daemon.server.exec.ExecuteBuild.doBuild(ExecuteBuild.java:65)
at org.gradle.launcher.daemon.server.exec.BuildCommandOnly.execute(BuildCommandOnly.java:37)
at org.gradle.launcher.daemon.server.api.DaemonCommandExecution.proceed(DaemonCommandExecution.java:104)
at org.gradle.launcher.daemon.server.exec.WatchForDisconnection.execute(WatchForDisconnection.java:39)
at org.gradle.launcher.daemon.server.api.DaemonCommandExecution.proceed(DaemonCommandExecution.java:104)
at org.gradle.launcher.daemon.server.exec.ResetDeprecationLogger.execute(ResetDeprecationLogger.java:29)
at org.gradle.launcher.daemon.server.api.DaemonCommandExecution.proceed(DaemonCommandExecution.java:104)
at org.gradle.launcher.daemon.server.exec.RequestStopIfSingleUsedDaemon.execute(RequestStopIfSingleUsedDaemon.java:35)
at org.gradle.launcher.daemon.server.api.DaemonCommandExecution.proceed(DaemonCommandExecution.java:104)
at org.gradle.launcher.daemon.server.exec.ForwardClientInput$2.create(ForwardClientInput.java:78)
at org.gradle.launcher.daemon.server.exec.ForwardClientInput$2.create(ForwardClientInput.java:75)
at org.gradle.util.internal.Swapper.swap(Swapper.java:38)
at org.gradle.launcher.daemon.server.exec.ForwardClientInput.execute(ForwardClientInput.java:75)
at org.gradle.launcher.daemon.server.api.DaemonCommandExecution.proceed(DaemonCommandExecution.java:104)
at org.gradle.launcher.daemon.server.exec.LogAndCheckHealth.execute(LogAndCheckHealth.java:55)
at org.gradle.launcher.daemon.server.api.DaemonCommandExecution.proceed(DaemonCommandExecution.java:104)
at org.gradle.launcher.daemon.server.exec.LogToClient.doBuild(LogToClient.java:63)
at org.gradle.launcher.daemon.server.exec.BuildCommandOnly.execute(BuildCommandOnly.java:37)
at org.gradle.launcher.daemon.server.api.DaemonCommandExecution.proceed(DaemonCommandExecution.java:104)
at org.gradle.launcher.daemon.server.exec.EstablishBuildEnvironment.doBuild(EstablishBuildEnvironment.java:84)
at org.gradle.launcher.daemon.server.exec.BuildCommandOnly.execute(BuildCommandOnly.java:37)
at org.gradle.launcher.daemon.server.api.DaemonCommandExecution.proceed(DaemonCommandExecution.java:104)
at org.gradle.launcher.daemon.server.exec.StartBuildOrRespondWithBusy$1.run(StartBuildOrRespondWithBusy.java:52)
at org.gradle.launcher.daemon.server.DaemonStateCoordinator$1.run(DaemonStateCoordinator.java:297)
at org.gradle.internal.concurrent.ExecutorPolicy$CatchAndRecordFailures.onExecute(ExecutorPolicy.java:64)
at org.gradle.internal.concurrent.ManagedExecutorImpl$1.run(ManagedExecutorImpl.java:49)
Caused by: org.gradle.api.internal.artifacts.ivyservice.DefaultLenientConfiguration$ArtifactResolveException: Could not resolve all files for configuration ':classpath'.
at org.gradle.api.internal.artifacts.configurations.DefaultConfiguration.mapFailure(DefaultConfiguration.java:1531)
at org.gradle.api.internal.artifacts.configurations.DefaultConfiguration.access$3800(DefaultConfiguration.java:159)
at org.gradle.api.internal.artifacts.configurations.DefaultConfiguration$DefaultResolutionHost.mapFailure(DefaultConfiguration.java:2183)
at org.gradle.api.internal.artifacts.configurations.DefaultConfiguration$DefaultResolutionHost.rethrowFailure(DefaultConfiguration.java:2188)
at org.gradle.api.internal.artifacts.configurations.DefaultConfiguration$ConfigurationFileCollection.visitContents(DefaultConfiguration.java:1499)
at org.gradle.api.internal.file.AbstractFileCollection.getFiles(AbstractFileCollection.java:129)
at org.gradle.api.internal.file.AbstractFileCollection.iterator(AbstractFileCollection.java:175)
at org.gradle.internal.classpath.DefaultClassPath.of(DefaultClassPath.java:56)
at org.gradle.api.internal.initialization.DefaultScriptClassPathResolver.resolveClassPath(DefaultScriptClassPathResolver.java:51)
at org.gradle.api.internal.initialization.DefaultScriptHandler.getNonInstrumentedScriptClassPath(DefaultScriptHandler.java:96)
at org.gradle.plugin.use.internal.DefaultPluginRequestApplicator.defineScriptHandlerClassScope(DefaultPluginRequestApplicator.java:177)
at org.gradle.plugin.use.internal.DefaultPluginRequestApplicator.applyPlugins(DefaultPluginRequestApplicator.java:142)
at org.gradle.kotlin.dsl.provider.PluginRequestsHandler.handle(PluginRequestsHandler.kt:48)
at org.gradle.kotlin.dsl.provider.StandardKotlinScriptEvaluator$InterpreterHost.applyPluginsTo(KotlinScriptEvaluator.kt:195)
at org.gradle.kotlin.dsl.execution.Interpreter$ProgramHost.applyPluginsTo(Interpreter.kt:398)
at Program.execute(Unknown Source)
at org.gradle.kotlin.dsl.execution.Interpreter$ProgramHost.eval(Interpreter.kt:532)
at org.gradle.kotlin.dsl.execution.Interpreter.eval(Interpreter.kt:205)
at org.gradle.kotlin.dsl.provider.StandardKotlinScriptEvaluator.evaluate(KotlinScriptEvaluator.kt:115)
at org.gradle.kotlin.dsl.provider.KotlinScriptPluginFactory$create$1.invoke(KotlinScriptPluginFactory.kt:51)
at org.gradle.kotlin.dsl.provider.KotlinScriptPluginFactory$create$1.invoke(KotlinScriptPluginFactory.kt:36)
at org.gradle.kotlin.dsl.provider.KotlinScriptPlugin.apply(KotlinScriptPlugin.kt:34)
at org.gradle.configuration.BuildOperationScriptPlugin$1.run(BuildOperationScriptPlugin.java:65)
at org.gradle.internal.operations.DefaultBuildOperationRunner$1.execute(DefaultBuildOperationRunner.java:29)
at org.gradle.internal.operations.DefaultBuildOperationRunner$1.execute(DefaultBuildOperationRunner.java:26)
at org.gradle.internal.operations.DefaultBuildOperationRunner$2.execute(DefaultBuildOperationRunner.java:66)
at org.gradle.internal.operations.DefaultBuildOperationRunner$2.execute(DefaultBuildOperationRunner.java:59)
at org.gradle.internal.operations.DefaultBuildOperationRunner.execute(DefaultBuildOperationRunner.java:157)
at org.gradle.internal.operations.DefaultBuildOperationRunner.execute(DefaultBuildOperationRunner.java:59)
at org.gradle.internal.operations.DefaultBuildOperationRunner.run(DefaultBuildOperationRunner.java:47)
at org.gradle.internal.operations.DefaultBuildOperationExecutor.run(DefaultBuildOperationExecutor.java:68)
at org.gradle.configuration.BuildOperationScriptPlugin.lambda$apply$0(BuildOperationScriptPlugin.java:62)
at org.gradle.configuration.internal.DefaultUserCodeApplicationContext.apply(DefaultUserCodeApplicationContext.java:44)
at org.gradle.configuration.BuildOperationScriptPlugin.apply(BuildOperationScriptPlugin.java:62)
at org.gradle.api.internal.project.DefaultProjectStateRegistry$ProjectStateImpl.lambda$applyToMutableState$0(DefaultProjectStateRegistry.java:360)
at org.gradle.api.internal.project.DefaultProjectStateRegistry$ProjectStateImpl.fromMutableState(DefaultProjectStateRegistry.java:378)
at org.gradle.api.internal.project.DefaultProjectStateRegistry$ProjectStateImpl.applyToMutableState(DefaultProjectStateRegistry.java:359)
at org.gradle.configuration.project.BuildScriptProcessor.execute(BuildScriptProcessor.java:42)
at org.gradle.configuration.project.BuildScriptProcessor.execute(BuildScriptProcessor.java:26)
at org.gradle.configuration.project.ConfigureActionsProjectEvaluator.evaluate(ConfigureActionsProjectEvaluator.java:35)
at org.gradle.configuration.project.LifecycleProjectEvaluator$EvaluateProject.lambda$run$0(LifecycleProjectEvaluator.java:109)
at org.gradle.api.internal.project.DefaultProjectStateRegistry$ProjectStateImpl.lambda$applyToMutableState$0(DefaultProjectStateRegistry.java:360)
at org.gradle.api.internal.project.DefaultProjectStateRegistry$ProjectStateImpl.lambda$fromMutableState$1(DefaultProjectStateRegistry.java:383)
at org.gradle.internal.work.DefaultWorkerLeaseService.withReplacedLocks(DefaultWorkerLeaseService.java:345)
at org.gradle.api.internal.project.DefaultProjectStateRegistry$ProjectStateImpl.fromMutableState(DefaultProjectStateRegistry.java:383)
at org.gradle.api.internal.project.DefaultProjectStateRegistry$ProjectStateImpl.applyToMutableState(DefaultProjectStateRegistry.java:359)
at org.gradle.configuration.project.LifecycleProjectEvaluator$EvaluateProject.run(LifecycleProjectEvaluator.java:100)
at org.gradle.internal.operations.DefaultBuildOperationRunner$1.execute(DefaultBuildOperationRunner.java:29)
at org.gradle.internal.operations.DefaultBuildOperationRunner$1.execute(DefaultBuildOperationRunner.java:26)
at org.gradle.internal.operations.DefaultBuildOperationRunner$2.execute(DefaultBuildOperationRunner.java:66)
at org.gradle.internal.operations.DefaultBuildOperationRunner$2.execute(DefaultBuildOperationRunner.java:59)
at org.gradle.internal.operations.DefaultBuildOperationRunner.execute(DefaultBuildOperationRunner.java:157)
at org.gradle.internal.operations.DefaultBuildOperationRunner.execute(DefaultBuildOperationRunner.java:59)
at org.gradle.internal.operations.DefaultBuildOperationRunner.run(DefaultBuildOperationRunner.java:47)
at org.gradle.internal.operations.DefaultBuildOperationExecutor.run(DefaultBuildOperationExecutor.java:68)
at org.gradle.configuration.project.LifecycleProjectEvaluator.evaluate(LifecycleProjectEvaluator.java:72)
at org.gradle.api.internal.project.DefaultProject.evaluate(DefaultProject.java:762)
at org.gradle.api.internal.project.DefaultProject.evaluate(DefaultProject.java:153)
at org.gradle.api.internal.project.ProjectLifecycleController.lambda$ensureSelfConfigured$1(ProjectLifecycleController.java:63)
at org.gradle.internal.model.StateTransitionController.lambda$doTransition$12(StateTransitionController.java:236)
at org.gradle.internal.model.StateTransitionController.doTransition(StateTransitionController.java:247)
at org.gradle.internal.model.StateTransitionController.doTransition(StateTransitionController.java:235)
at org.gradle.internal.model.StateTransitionController.lambda$maybeTransitionIfNotCurrentlyTransitioning$9(StateTransitionController.java:196)
at org.gradle.internal.work.DefaultSynchronizer.withLock(DefaultSynchronizer.java:34)
at org.gradle.internal.model.StateTransitionController.maybeTransitionIfNotCurrentlyTransitioning(StateTransitionController.java:192)
at org.gradle.api.internal.project.ProjectLifecycleController.ensureSelfConfigured(ProjectLifecycleController.java:63)
at org.gradle.api.internal.project.DefaultProjectStateRegistry$ProjectStateImpl.ensureConfigured(DefaultProjectStateRegistry.java:334)
at org.gradle.execution.TaskPathProjectEvaluator.configure(TaskPathProjectEvaluator.java:33)
at org.gradle.execution.TaskPathProjectEvaluator.configureHierarchy(TaskPathProjectEvaluator.java:47)
at org.gradle.configuration.DefaultProjectsPreparer.prepareProjects(DefaultProjectsPreparer.java:50)
at org.gradle.configuration.BuildTreePreparingProjectsPreparer.prepareProjects(BuildTreePreparingProjectsPreparer.java:64)
at org.gradle.configuration.BuildOperationFiringProjectsPreparer$ConfigureBuild.run(BuildOperationFiringProjectsPreparer.java:52)
at org.gradle.internal.operations.DefaultBuildOperationRunner$1.execute(DefaultBuildOperationRunner.java:29)
at org.gradle.internal.operations.DefaultBuildOperationRunner$1.execute(DefaultBuildOperationRunner.java:26)
at org.gradle.internal.operations.DefaultBuildOperationRunner$2.execute(DefaultBuildOperationRunner.java:66)
at org.gradle.internal.operations.DefaultBuildOperationRunner$2.execute(DefaultBuildOperationRunner.java:59)
at org.gradle.internal.operations.DefaultBuildOperationRunner.execute(DefaultBuildOperationRunner.java:157)
at org.gradle.internal.operations.DefaultBuildOperationRunner.execute(DefaultBuildOperationRunner.java:59)
at org.gradle.internal.operations.DefaultBuildOperationRunner.run(DefaultBuildOperationRunner.java:47)
at org.gradle.internal.operations.DefaultBuildOperationExecutor.run(DefaultBuildOperationExecutor.java:68)
at org.gradle.configuration.BuildOperationFiringProjectsPreparer.prepareProjects(BuildOperationFiringProjectsPreparer.java:40)
at org.gradle.initialization.VintageBuildModelController.lambda$prepareProjects$2(VintageBuildModelController.java:84)
at org.gradle.internal.model.StateTransitionController.lambda$doTransition$12(StateTransitionController.java:236)
at org.gradle.internal.model.StateTransitionController.doTransition(StateTransitionController.java:247)
at org.gradle.internal.model.StateTransitionController.doTransition(StateTransitionController.java:235)
at org.gradle.internal.model.StateTransitionController.lambda$transitionIfNotPreviously$10(StateTransitionController.java:210)
at org.gradle.internal.work.DefaultSynchronizer.withLock(DefaultSynchronizer.java:34)
at org.gradle.internal.model.StateTransitionController.transitionIfNotPreviously(StateTransitionController.java:206)
at org.gradle.initialization.VintageBuildModelController.prepareProjects(VintageBuildModelController.java:84)
at org.gradle.initialization.VintageBuildModelController.prepareToScheduleTasks(VintageBuildModelController.java:71)
at org.gradle.configurationcache.ConfigurationCacheAwareBuildModelController.prepareToScheduleTasks(ConfigurationCacheAwareBuildModelController.kt:49)
at org.gradle.internal.build.DefaultBuildLifecycleController.lambda$prepareToScheduleTasks$2(DefaultBuildLifecycleController.java:129)
at org.gradle.internal.model.StateTransitionController.lambda$doTransition$12(StateTransitionController.java:236)
at org.gradle.internal.model.StateTransitionController.doTransition(StateTransitionController.java:247)
at org.gradle.internal.model.StateTransitionController.doTransition(StateTransitionController.java:235)
at org.gradle.internal.model.StateTransitionController.lambda$maybeTransition$8(StateTransitionController.java:187)
at org.gradle.internal.work.DefaultSynchronizer.withLock(DefaultSynchronizer.java:34)
at org.gradle.internal.model.StateTransitionController.maybeTransition(StateTransitionController.java:183)
at org.gradle.internal.build.DefaultB
|
|
DefaultConfigTests.apiCheck should fail, when a public class is not in api-File():
modules/bcv-gradle-plugin-functional-tests/src/functionalTest/kotlin/kotlinx/validation/test/DefaultConfigTests.kt#L135
java.lang.AssertionError: BuildResult should have run task :apiCheck. All tasks:
|
|
tests / gradle-check (ubuntu-latest, check --continue) / ./gradlew check --continue --stacktrace @ ubuntu-latest
This job uses deprecated functionality from the 'gradle/gradle-build-action' action. Consult the Job Summary for more details.
|
|
tests / gradle-check (ubuntu-latest, check --continue) / ./gradlew check --continue --stacktrace @ ubuntu-latest
Failed to restore gradle-home-v1|Linux|run-task[5c9e33ceaf6ef90f9629a6e003d478ac]-ee57747b910ce4c06a705a56a22f4dcb6184c6e8: Error: Cache service responded with 400
|
|
tests / gradle-check (windows-latest, check --continue) / ./gradlew check --continue --stacktrace @ windows-latest
This job uses deprecated functionality from the 'gradle/gradle-build-action' action. Consult the Job Summary for more details.
|
|
tests / gradle-check (windows-latest, check --continue) / ./gradlew check --continue --stacktrace @ windows-latest
Failed to restore gradle-home-v1|Windows|run-task[5c9e33ceaf6ef90f9629a6e003d478ac]-ee57747b910ce4c06a705a56a22f4dcb6184c6e8: Error: Cache service responded with 400
|
|
tests / gradle-check (macos-latest, check --continue) / ./gradlew check --continue --stacktrace @ macos-latest
This job uses deprecated functionality from the 'gradle/gradle-build-action' action. Consult the Job Summary for more details.
|
|
tests / gradle-check (macos-latest, check --continue) / ./gradlew check --continue --stacktrace @ macos-latest
Failed to restore gradle-home-v1|macOS|run-task[5c9e33ceaf6ef90f9629a6e003d478ac]-ee57747b910ce4c06a705a56a22f4dcb6184c6e8: Error: Cache service responded with 400
|
|
tests / gradle-check (windows-latest, check --continue) / ./gradlew check --continue --stacktrace @ windows-latest
The windows-latest label will migrate from Windows Server 2022 to Windows Server 2025 beginning September 2, 2025. For more information see https://github.com/actions/runner-images/issues/12677
|
|
tests / gradle-check (macos-latest, check --continue) / ./gradlew check --continue --stacktrace @ macos-latest
The macos-latest label will migrate to macOS 15 beginning August 4, 2025. For more information see https://github.com/actions/runner-images/issues/12520
|
|
tests / gradle-check (macos-latest, check --continue) / ./gradlew check --continue --stacktrace @ macos-latest
The macos-latest label will migrate to macOS 15 beginning August 4, 2025. For more information see https://github.com/actions/runner-images/issues/12520
|